waistcoat
New member
- Joined
- Jan 6, 2017
- Messages
- 11
- Reaction score
- 2
- Points
- 3
- What type of support thread are you creating?
- Possible bug
- What OpenViX Image build number are you using?
- 6.8.010 / 6.9.001
- Have you tried re-flashing WITHOUT settings restore?
- NO
- Have you tried re-flashing WITH a settings restore?
- NO
As my reciever is no longer getting pre-built releases, I've been compiling my own since 6.8 was released.
Since after 21-July-26 I haven't been able to cleanly compile OpenVIX feeds as tsduck complains about missing librist headers. In fact this is the last package of tsduck I've managed to cleanly compile without hacks:
Since I got stuck on 6.8.010 I see we've moved on to 6.9 release with oe branch 6.0, I've managed to get feeds to now compile by manually adding
Anyone else experiencing this buidling for other platforma? Any suggestions? Am I doing something wrong?
As I don't actually use tsduck I'm guessing I could use
-Steve
...
...
Since after 21-July-26 I haven't been able to cleanly compile OpenVIX feeds as tsduck complains about missing librist headers. In fact this is the last package of tsduck I've managed to cleanly compile without hacks:
Jun 19 00:22 tsduck_3.41-4299-git4367+b1848920+b18489209c-r0_mips32el.ipkSince I got stuck on 6.8.010 I see we've moved on to 6.9 release with oe branch 6.0, I've managed to get feeds to now compile by manually adding
NORIST=1 to meta-oe-alliance/meta-oe/recipes-support/tsduck/tsduck_git.bb.Anyone else experiencing this buidling for other platforma? Any suggestions? Am I doing something wrong?
As I don't actually use tsduck I'm guessing I could use
BBMASK once I figure it out to somehow to not build it at all.-Steve
Code:
ERROR: tsduck-git-r0 do_compile: Execution of '/home/smg/openvix/build-enviroment.x/builds/openvix/release/et8500/tmp/work/mips32el-oe-linux/tsduck/git/temp/run.do_compile.1821075' failed with exit code 1
Code:
| In file included from /home/smg/openvix/build-enviroment.x/builds/openvix/release/et8500/tmp/work/mips32el-oe-linux/tsduck/git/sources/tsduck-git/src/libtsduck/plugins/private/tsRISTPluginData.h:16,
| from plugins/plugins/tsRISTInputPlugin.cpp:10:
| /home/smg/openvix/build-enviroment.x/builds/openvix/release/et8500/tmp/work/mips32el-oe-linux/tsduck/git/sources/tsduck-git/src/libtsduck/network/private/tsLibRIST.h:43:55: error: missing binary operator before token '('
| 43 | #if LIBRIST_API_VERSION < LIBRIST_MAKE_API_VERSION(4, 2, 0)
Code:
| In file included from network/tsRIST.cpp:10:
| /home/smg/openvix/build-enviroment.x/builds/openvix/release/et8500/tmp/work/mips32el-oe-linux/tsduck/git/sources/tsduck-git/src/libtsduck/network/private/tsLibRIST.h:39:14: fatal error: librist/librist.h: No such file or directory
| 39 | #include <librist/librist.h>
| | ^~~~~~~~~~~~~~~~~~~
| compilation terminated.
| make[2]: *** [../../Makefile.inc:66: /home/smg/openvix/build-enviroment.x/builds/openvix/release/et8500/tmp/work/mips32el-oe-linux/tsduck/git/sources/tsduck-git/bin/release-mips32el-vpro/objs-libtsduck/tsRIST.o] Error 1

